Target
Vasopressin V1a receptor
Ligand
BDBM50350882
Substrate
Meas. Tech.
ChEMBL_763490 (CHEMBL1819839)
EC50
0.54±n/a nM
Citation
 Wisniewski, KGalyean, RTariga, HAlagarsamy, SCroston, GHeitzmann, JKohan, AWisniewska, HLaporte, RRivière, PJSchteingart, CD New, potent, selective, and short-acting peptidic V1a receptor agonists. J Med Chem 54:4388-98 (2011)  
Target
Name:
Vasopressin V1a receptor
Synonyms:
AVPR V1a AVPR1A V1AR_HUMAN VASOPRESSIN V1A Vasopressin V1 receptor Vasopressin receptor
Type:
Receptor
Mol. Mass.:
46820.18
Organism:
Homo sapiens (Human)
Description:
P37288
Residue:
418
  
Inhibitor
Name:
BDBM50350882
Synonyms:
CHEMBL1819548
Type:
Small organic molecule
Emp. Form.:
C39H61N13O11S3
Mol. Mass.:
984.177
SMILES:
CC[C@H](C)[C@@H]1NC(=O)[C@H](Cc2cccs2)NC(=O)[C@@H](N)CSSC[C@H](NC(=O)[C@H](CC(N)=O)NC(=O)[C@H](CCC(N)=O)NC1=O)C(=O)N1CCC[C@H]1C(=O)N[C@@H](CCN)C(=O)NCC(N)=O
: