Target
Glycogen phosphorylase, muscle form
Ligand
BDBM50351155
Substrate
Meas. Tech.
ChEMBL_764140 (CHEMBL1821351)
pH
6.8±n/a
IC50
39800±n/a nM
Comments
extracted
Citation
 Alexacou, KMZhang, YZPraly, JPZographos, SEChrysina, EDOikonomakos, NGLeonidas, DD Halogen-substituted (C-ß-D-glucopyranosyl)-hydroquinone regioisomers: synthesis, enzymatic evaluation and their binding to glycogen phosphorylase. Bioorg Med Chem 19:5125-36 (2011)  
Target
Name:
Glycogen phosphorylase, muscle form
Synonyms:
Glycogen Phosphorylase (PYGM) Glycogen phosphorylase, muscle form PYGM | PYGM_RABIT
Type:
Enzyme
Mol. Mass.:
97296.32
Organism:
Oryctolagus cuniculus (rabbit)
Description:
Phosphorylation of Ser-15 converts phosphorylase B (unphosphorylated) to phosphorylase A.
Residue:
843
  
Inhibitor
Name:
BDBM50351155
Synonyms:
CHEMBL1738940
Type:
Small organic molecule
Emp. Form.:
C13H17ClO7
Mol. Mass.:
320.723
SMILES:
COc1cc(Cl)c(O)c(c1)[C@@H]1O[C@H](CO)[C@@H](O)[C@H](O)[C@H]1O
: