Target
Hepatocyte growth factor receptor
Ligand
BDBM24503
Substrate
Meas. Tech.
ChEMBL_764847 (CHEMBL1826790)
IC50
69±n/a nM
Citation
 Xie, QQZhong, LPan, YLWang, XYZhou, JPDi-Wu, LHuang, QWang, YLYang, LLXie, HZYang, SY Combined SVM-based and docking-based virtual screening for retrieving novel inhibitors of c-Met. Eur J Med Chem 46:3675-80 (2011)  
Target
Name:
Hepatocyte growth factor receptor
Synonyms:
Hepatocyte growth factor receptor Hepatocyte growth factor receptor (c-MET) MET Met proto-oncogene (hepatocyte growth factor receptor) Tyrosine-protein kinase Met (c-Met) c-Met kinase
Type:
Protein
Mol. Mass.:
155559.73
Organism:
Homo sapiens (Human)
Description:
P08581
Residue:
1390
  
Inhibitor
Name:
BDBM24503
Synonyms:
3-(3-fluoro-4-{[2-(1-methyl-1H-1,2,4-triazol-5-yl)thieno[3,2-b]pyridin-7-yl]oxy}phenyl)-1-(2-phenylacetyl)thiourea | thieno[3,2-b]pyridine-based inhibitor, 10f
Type:
Small organic molecule
Emp. Form.:
C25H19FN6O2S2
Mol. Mass.:
518.586
SMILES:
Cn1ncnc1-c1cc2nccc(Oc3ccc(NC(=S)NC(=O)Cc4ccccc4)cc3F)c2s1
: