Target
Beta-secretase 1
Ligand
BDBM50351911
Substrate
Meas. Tech.
ChEMBL_765827 (CHEMBL1827652)
IC50
400000±n/a nM
Citation
 Cheng, YJudd, TCBartberger, MDBrown, JChen, KFremeau, RTHickman, DHitchcock, SAJordan, BLi, VLopez, PLouie, SWLuo, YMichelsen, KNixey, TPowers, TSRattan, CSickmier, EASt Jean, DJWahl, RCWen, PHWood, S From fragment screening to in vivo efficacy: optimization of a series of 2-aminoquinolines as potent inhibitors of beta-site amyloid precursor protein cleaving enzyme 1 (BACE1). J Med Chem 54:5836-57 (2011)  
Target
Name:
Beta-secretase 1
Synonyms:
ASP2 Aspartyl protease 2 BACE1 Beta-secretase (BACE) Beta-secretase 1 (BACE 1) Beta-secretase 1 (BACE1) Beta-site amyloid precursor protein cleaving enzyme 1 Memapsin-2 beta-Secretase (BACE-1) | beta-Secretase (BACE1)
Type:
Protein
Mol. Mass.:
55755.10
Organism:
Homo sapiens (Human)
Description:
P56817
Residue:
501
  
Inhibitor
Name:
BDBM50351911
Synonyms:
CHEMBL1821800
Type:
Small organic molecule
Emp. Form.:
C9H7BrN2
Mol. Mass.:
223.069
SMILES:
Nc1ccc2c(Br)cccc2n1
: