Target
Fibroblast growth factor receptor 2
Ligand
BDBM50344664
Substrate
Meas. Tech.
ChEMBL_766965 (CHEMBL1828190)
IC50
360±n/a nM
Citation
 Kinoshita, KKobayashi, TAsoh, KFuruichi, NIto, TKawada, HHara, SOhwada, JHattori, KMiyagi, THong, WSPark, MJTakanashi, KTsukaguchi, TSakamoto, HTsukuda, TOikawa, N 9-substituted 6,6-dimethyl-11-oxo-6,11-dihydro-5H-benzo[b]carbazoles as highly selective and potent anaplastic lymphoma kinase inhibitors. J Med Chem 54:6286-94 (2011)  
Target
Name:
Fibroblast growth factor receptor 2
Synonyms:
BEK FGFR-2 FGFR2 Fibroblast growth factor receptor 2 (FGFR2) KGFR Keratinocyte growth factor receptor VEGF-receptor 2 and Fibroblast growth factor receptor 2
Type:
Enzyme
Mol. Mass.:
92015.45
Organism:
Homo sapiens (Human)
Description:
P21802
Residue:
821
  
Inhibitor
Name:
BDBM50344664
Synonyms:
6,6-dimethyl-8-(1-(oxetan-3-yl)piperidin-4-yl)-11-oxo-6,11-dihydro-5H-benzo[b]carbazole-3-carbonitrile US9126931, 178
Type:
Small organic molecule
Emp. Form.:
C27H27N3O2
Mol. Mass.:
425.5222
SMILES:
CC1(C)c2[nH]c3cc(ccc3c2C(=O)c2ccc(cc12)C1CCN(CC1)C1COC1)C#N
: