Target
Histone deacetylase 7
Ligand
BDBM50353227
Substrate
Meas. Tech.
ChEMBL_769063 (CHEMBL1832526)
Ki
19.0±n/a nM
Citation
 Wang, HYu, NChen, DLee, KCLye, PLChang, JWDeng, WNg, MCLu, TKhoo, MLPoulsen, ASangthongpitag, KWu, XHu, CGoh, KCWang, XFang, LGoh, KLKhng, HHGoh, SKYeo, PLiu, XBonday, ZWood, JMDymock, BWKantharaj, ESun, ET Discovery of (2E)-3-{2-butyl-1-[2-(diethylamino)ethyl]-1H-benzimidazol-5-yl}-N-hydroxyacrylamide (SB939), an orally active histone deacetylase inhibitor with a superior preclinical profile. J Med Chem 54:4694-720 (2011)  
Target
Name:
Histone deacetylase 7
Synonyms:
HD7 HDAC7A Histone acetylase 7 (HDAC7) Human HDAC7
Type:
Chromatin regulator; hydrolase; repressor
Mol. Mass.:
102942.62
Organism:
Homo sapiens (Human)
Description:
Q8WUI4
Residue:
952
  
Inhibitor
Name:
BDBM50353227
Synonyms:
CHEMBL3215861
Type:
Small organic molecule
Emp. Form.:
C20H32Cl2N4O2
Mol. Mass.:
431.4
SMILES:
Cl.Cl.CCCCc1nc2cc(\C=C\C(=O)NO)ccc2n1CCN(CC)CC
: