Target
Inhibitor of nuclear factor kappa-B kinase subunit beta
Ligand
BDBM25957
Substrate
Meas. Tech.
ChEMBL_769089 (CHEMBL1832646)
IC50
8±n/a nM
Citation
 Sun, HPZhu, JChen, FHZhang, SLZhang, YYou, QD Combination of pharmacophore model development and binding mode analyses: identification of ligand features essential for I¿B kinase-beta (IKKß) inhibitors and virtual screening based on it. Eur J Med Chem 46:3942-52 (2011)  
Target
Name:
Inhibitor of nuclear factor kappa-B kinase subunit beta
Synonyms:
I-kappa-B Kinase 2 (IKK-beta) I-kappa-B-kinase beta IKBKB IKK-beta IKK2/IKK1 IKKB_HUMAN Inhibitor of nuclear factor kappa B kinase beta subunit Nuclear factor NF-kappa-B inhibitor kinase beta
Type:
Serine/threonine-protein kinase
Mol. Mass.:
86554.39
Organism:
Homo sapiens (Human)
Description:
GST-tagged IKK-2 was expressed in High Five cells and purified.
Residue:
756
  
Inhibitor
Name:
BDBM25957
Synonyms:
4-[3-(aminomethyl)phenyl]-N,12-dimethyl-3-thia-1,7,10-triazatricyclo[7.3.0.0^{2,6}]dodeca-2(6),4,7,9,11-pentaen-8-amine | imidazothienopyrazine, 22a
Type:
Small organic molecule
Emp. Form.:
C17H17N5S
Mol. Mass.:
323.415
SMILES:
CNc1nc2cc(sc2n2c(C)cnc12)-c1cccc(CN)c1
: