Target
Caspase-2
Ligand
BDBM50355101
Substrate
Meas. Tech.
ChEMBL_773169 (CHEMBL1838645)
IC50
2260±n/a nM
Citation
 Maillard, MCBrookfield, FACourtney, SMEustache, FMGemkow, MJHandel, RKJohnson, LCJohnson, PDKerry, MAKrieger, FMeniconi, MMuñoz-Sanjuán, IPalfrey, JJPark, HSchaertl, STaylor, MGWeddell, DDominguez, C Exploiting differences in caspase-2 and -3 S2 subsites for selectivity: structure-based design, solid-phase synthesis and in vitro activity of novel substrate-based caspase-2 inhibitors. Bioorg Med Chem 19:5833-51 (2011)  
Target
Name:
Caspase-2
Synonyms:
CASP-2 CASP2_HUMAN Caspase-2 subunit p13 ICH-1 protease ICH1 NEDD2 | Neural precursor cell expressed developmentally down-regulated protein 2
Type:
Enzyme
Mol. Mass.:
50688.29
Organism:
Homo sapiens (Human)
Description:
P42575
Residue:
452
  
Inhibitor
Name:
BDBM50355101
Synonyms:
CHEMBL1835324
Type:
Small organic molecule
Emp. Form.:
C30H41N5O10
Mol. Mass.:
631.674
SMILES:
CC(C)[C@H](NC(C)=O)C(=O)N[C@@H](CC(O)=O)C(=O)N[C@@H](C(C)C)C(=O)N1CCc2ccccc2[C@H]1C(=O)N[C@H]1CC(=O)OC1O
: