Target
Ribosomal protein S6 kinase alpha-5
Ligand
BDBM4779
Substrate
Meas. Tech.
ChEMBL_774216 (CHEMBL1908433)
Kd
>10000±n/a nM
Citation
 Davis, MIHunt, JPHerrgard, SCiceri, PWodicka, LMPallares, GHocker, MTreiber, DKZarrinkar, PP Comprehensive analysis of kinase inhibitor selectivity. Nat Biotechnol 29:1046-51 (2011)  
Target
Name:
Ribosomal protein S6 kinase alpha-5
Synonyms:
90 kDa ribosomal protein S6 kinase 5 MSK1 Nuclear mitogen- and stress-activated protein kinase 1 RPS6KA5 RSK-like protein kinase Ribosomal protein S6 kinase Ribosomal protein S6 kinase alpha-5
Type:
Serine/threonine-protein kinase
Mol. Mass.:
89874.44
Organism:
Homo sapiens (Human)
Description:
Residue:
802
  
Inhibitor
Name:
BDBM4779
Synonyms:
CHEMBL31965 CI-1033 N-{4-[(3-chloro-4-fluorophenyl)amino]-7-[3-(morpholin-4-yl)propoxy]quinazolin-6-yl}prop-2-enamide US10507209, Compound CI-1033 cid_156414
Type:
Small organic molecule
Emp. Form.:
C24H25ClFN5O3
Mol. Mass.:
485.938
SMILES:
Fc1ccc(Nc2ncnc3cc(OCCCN4CCOCC4)c(NC(=O)C=C)cc23)cc1Cl
: