Target
Mast/stem cell growth factor receptor Kit
Ligand
BDBM25628
Substrate
Meas. Tech.
ChEMBL_774268 (CHEMBL1908485)
Kd
>10000±n/a nM
Citation
 Davis, MIHunt, JPHerrgard, SCiceri, PWodicka, LMPallares, GHocker, MTreiber, DKZarrinkar, PP Comprehensive analysis of kinase inhibitor selectivity. Nat Biotechnol 29:1046-51 (2011)  
Target
Name:
Mast/stem cell growth factor receptor Kit
Synonyms:
CD117 antigen KIT Mast/stem cell growth factor receptor Kit (cKIT) Proto-oncogene tyrosine-protein kinase Kit Stem cell growth factor receptor Tyrosine-protein kinase Kit c-kit v-kit Hardy-Zuckerman 4 feline sarcoma viral oncogene homolog
Type:
Protein
Mol. Mass.:
109869.37
Organism:
Homo sapiens (Human)
Description:
P10721
Residue:
976
  
Inhibitor
Name:
BDBM25628
Synonyms:
2-{4-[(1Z)-1-(hydroxyimino)-2,3-dihydro-1H-inden-5-yl]-3-(pyridin-4-yl)-1H-pyrazol-1-yl}ethan-1-ol CHEMBL525191 | GDC-0879
Type:
Small organic molecule
Emp. Form.:
C19H18N4O2
Mol. Mass.:
334.3718
SMILES:
OCCn1cc(c(n1)-c1ccncc1)-c1ccc2C(CCc2c1)N=O
: