Target
Macrophage-stimulating protein receptor
Ligand
BDBM25628
Substrate
Meas. Tech.
ChEMBL_774348 (CHEMBL1908565)
Kd
>10000±n/a nM
Citation
 Davis, MIHunt, JPHerrgard, SCiceri, PWodicka, LMPallares, GHocker, MTreiber, DKZarrinkar, PP Comprehensive analysis of kinase inhibitor selectivity. Nat Biotechnol 29:1046-51 (2011)  
Target
Name:
Macrophage-stimulating protein receptor
Synonyms:
2.7.10.1 CDw136 MST1R Macrophage-stimulating protein receptor alpha chain PTK8 RON Tyrosine kinase receptor ron | p185-Ron
Type:
Protein
Mol. Mass.:
152270.76
Organism:
Homo sapiens (Human)
Description:
Q04912
Residue:
1400
  
Inhibitor
Name:
BDBM25628
Synonyms:
2-{4-[(1Z)-1-(hydroxyimino)-2,3-dihydro-1H-inden-5-yl]-3-(pyridin-4-yl)-1H-pyrazol-1-yl}ethan-1-ol CHEMBL525191 | GDC-0879
Type:
Small organic molecule
Emp. Form.:
C19H18N4O2
Mol. Mass.:
334.3718
SMILES:
OCCn1cc(c(n1)-c1ccncc1)-c1ccc2C(CCc2c1)N=O
: