Target
Serine/threonine-protein kinase DCLK3
Ligand
BDBM50026612
Substrate
Meas. Tech.
ChEMBL_774187 (CHEMBL1908404)
Kd
770±n/a nM
Citation
 Davis, MIHunt, JPHerrgard, SCiceri, PWodicka, LMPallares, GHocker, MTreiber, DKZarrinkar, PP Comprehensive analysis of kinase inhibitor selectivity. Nat Biotechnol 29:1046-51 (2011)  
Target
Name:
Serine/threonine-protein kinase DCLK3
Synonyms:
DCAMKL3 DCLK3 KIAA1765 | Serine/threonine-protein kinase DCLK3
Type:
PROTEIN
Mol. Mass.:
73837.68
Organism:
Homo sapiens (Human)
Description:
ChEMBL_586565
Residue:
648
  
Inhibitor
Name:
BDBM50026612
Synonyms:
BIBF-1120 US10981896, Compound Nintedanib US11208381, Nintedanib | Vargatef
Type:
Small organic molecule
Emp. Form.:
C31H33N5O4
Mol. Mass.:
539.6248
SMILES:
COC(=O)c1ccc2\C(=C(\Nc3ccc(cc3)N(C)C(=O)CN3CCN(C)CC3)c3ccccc3)C(=O)Nc2c1
: