Target
Mitogen-activated protein kinase kinase kinase kinase 3
Ligand
BDBM50326053
Substrate
Meas. Tech.
ChEMBL_774401 (CHEMBL1908618)
Kd
120±n/a nM
Citation
 Davis, MIHunt, JPHerrgard, SCiceri, PWodicka, LMPallares, GHocker, MTreiber, DKZarrinkar, PP Comprehensive analysis of kinase inhibitor selectivity. Nat Biotechnol 29:1046-51 (2011)  
Target
Name:
Mitogen-activated protein kinase kinase kinase kinase 3
Synonyms:
M4K3_HUMAN RAB8IPL1
Type:
PROTEIN
Mol. Mass.:
101331.91
Organism:
Homo sapiens (Human)
Description:
ChEMBL_586461
Residue:
894
  
Inhibitor
Name:
BDBM50326053
Synonyms:
CHEMBL608533 | PKC-412
Type:
Small organic molecule
Emp. Form.:
C35H30N4O4
Mol. Mass.:
570.6371
SMILES:
CO[C@@H]1[C@@H](C[C@H]2O[C@]1(C)n1c3ccccc3c3c4CNC(=O)c4c4c5ccccc5n2c4c13)N(C)C(=O)c1ccccc1
: