Target
Calcium/calmodulin-dependent protein kinase type II subunit beta
Ligand
BDBM50332294
Substrate
Meas. Tech.
ChEMBL_774307 (CHEMBL1908524)
Kd
6800±n/a nM
Citation
 Davis, MIHunt, JPHerrgard, SCiceri, PWodicka, LMPallares, GHocker, MTreiber, DKZarrinkar, PP Comprehensive analysis of kinase inhibitor selectivity. Nat Biotechnol 29:1046-51 (2011)  
Target
Name:
Calcium/calmodulin-dependent protein kinase type II subunit beta
Synonyms:
CAM2 CAMK2B CaM kinase II CaM kinase II subunit beta CaMK-II subunit beta Calcium/calmodulin-dependent protein kinase type II beta chain | KCC2B_HUMAN
Type:
Enzyme Catalytic Domain
Mol. Mass.:
72685.48
Organism:
Homo sapiens (Human)
Description:
gi_26051204
Residue:
666
  
Inhibitor
Name:
BDBM50332294
Synonyms:
CHEMBL1287853 US10112907, Example 00018 US10766894, Compound TABLE 1.3 US11384069, Example T-5
Type:
Small organic molecule
Emp. Form.:
C27H36N6O3S
Mol. Mass.:
524.678
SMILES:
Cc1cnc(Nc2ccc(OCCN3CCCC3)cc2)nc1Nc1cccc(c1)S(=O)(=O)NC(C)(C)C
: