Target
Ephrin type-B receptor 6
Ligand
BDBM50355495
Substrate
Meas. Tech.
ChEMBL_774437 (CHEMBL1908654)
Kd
>10000±n/a nM
Citation
 Davis, MIHunt, JPHerrgard, SCiceri, PWodicka, LMPallares, GHocker, MTreiber, DKZarrinkar, PP Comprehensive analysis of kinase inhibitor selectivity. Nat Biotechnol 29:1046-51 (2011)  
Target
Name:
Ephrin type-B receptor 6
Synonyms:
EPHB6 Ephrin receptor HEP | Tyrosine-protein kinase-defective receptor EPH-6
Type:
PROTEIN
Mol. Mass.:
110701.54
Organism:
Homo sapiens (Human)
Description:
ChEMBL_774437
Residue:
1021
  
Inhibitor
Name:
BDBM50355495
Synonyms:
CHEMBL1908391
Type:
Small organic molecule
Emp. Form.:
C28H30N6OS
Mol. Mass.:
498.642
SMILES:
CN1CCN(Cc2ccc(cc2)C(=O)Nc2ccc(C)c(Nc3nc(cs3)-c3cccnc3)c2)CC1
: