Target
Serine/threonine-protein kinase tousled-like 1
Ligand
BDBM6568
Substrate
Meas. Tech.
ChEMBL_774549 (CHEMBL1908766)
Kd
>10000±n/a nM
Citation
 Davis, MIHunt, JPHerrgard, SCiceri, PWodicka, LMPallares, GHocker, MTreiber, DKZarrinkar, PP Comprehensive analysis of kinase inhibitor selectivity. Nat Biotechnol 29:1046-51 (2011)  
Target
Name:
Serine/threonine-protein kinase tousled-like 1
Synonyms:
KIAA0137 TLK1 | TLK1_HUMAN
Type:
Enzyme Catalytic Domain
Mol. Mass.:
86722.30
Organism:
Homo sapiens (Human)
Description:
gi_33636698
Residue:
766
  
Inhibitor
Name:
BDBM6568
Synonyms:
6-(2,6-dichlorophenyl)-8-methyl-2-{[3-(methylsulfanyl)phenyl]amino}-7H,8H-pyrido[2,3-d]pyrimidin-7-one PD-173955 US11136333, Compound PD173955
Type:
Small organic molecule
Emp. Form.:
C21H16Cl2N4OS
Mol. Mass.:
443.349
SMILES:
CSc1cccc(Nc2ncc3cc(-c4c(Cl)cccc4Cl)c(=O)n(C)c3n2)c1
: