Target
Ephrin type-B receptor 6
Ligand
BDBM50128285
Substrate
Meas. Tech.
ChEMBL_774437 (CHEMBL1908654)
Kd
>10000±n/a nM
Citation
 Davis, MIHunt, JPHerrgard, SCiceri, PWodicka, LMPallares, GHocker, MTreiber, DKZarrinkar, PP Comprehensive analysis of kinase inhibitor selectivity. Nat Biotechnol 29:1046-51 (2011)  
Target
Name:
Ephrin type-B receptor 6
Synonyms:
EPHB6 Ephrin receptor HEP | Tyrosine-protein kinase-defective receptor EPH-6
Type:
PROTEIN
Mol. Mass.:
110701.54
Organism:
Homo sapiens (Human)
Description:
ChEMBL_774437
Residue:
1021
  
Inhibitor
Name:
BDBM50128285
Synonyms:
3-(1-Methyl-1H-indol-3-yl)-4-[1-(1-pyridin-2-ylmethyl-piperidin-4-yl)-1H-indol-3-yl]-pyrrole-2,5-dione | CHEMBL300138
Type:
Small organic molecule
Emp. Form.:
C32H29N5O2
Mol. Mass.:
515.605
SMILES:
Cn1cc(C2=C(C(=O)NC2=O)c2cn(C3CCN(Cc4ccccn4)CC3)c3ccccc23)c2ccccc12
: