Target
Activin receptor type-2A
Ligand
BDBM12621
Substrate
Meas. Tech.
ChEMBL_774318 (CHEMBL1908535)
Kd
>10000±n/a nM
Citation
 Davis, MIHunt, JPHerrgard, SCiceri, PWodicka, LMPallares, GHocker, MTreiber, DKZarrinkar, PP Comprehensive analysis of kinase inhibitor selectivity. Nat Biotechnol 29:1046-51 (2011)  
Target
Name:
Activin receptor type-2A
Synonyms:
ACVR2 AVR2A_HUMAN | Activin receptor type-2A
Type:
Enzyme Catalytic Domain
Mol. Mass.:
57840.94
Organism:
Homo sapiens (Human)
Description:
gi_4501897
Residue:
513
  
Inhibitor
Name:
BDBM12621
Synonyms:
2,4-Diamino-5-ketopyrimidine 39 R547 | [4-Amino-2-(1-methanesulfonylpiperidin-4-ylamino)pyrimidin-5-yl](2,3-difluoro-6-methoxyphenyl)methanone
Type:
Small organic molecule
Emp. Form.:
C18H21F2N5O4S
Mol. Mass.:
441.452
SMILES:
COc1ccc(F)c(F)c1C(=O)c1cnc(NC2CCN(CC2)S(C)(=O)=O)nc1N
: