Target
Dual serine/threonine and tyrosine protein kinase
Ligand
BDBM16673
Substrate
Meas. Tech.
ChEMBL_774238 (CHEMBL1908455)
Kd
>10000±n/a nM
Citation
 Davis, MIHunt, JPHerrgard, SCiceri, PWodicka, LMPallares, GHocker, MTreiber, DKZarrinkar, PP Comprehensive analysis of kinase inhibitor selectivity. Nat Biotechnol 29:1046-51 (2011)  
Target
Name:
Dual serine/threonine and tyrosine protein kinase
Synonyms:
DSTYK Dusty PK KIAA0472 RIP5 Receptor-interacting serine/threonine-protein kinase 5 Sugen kinase 496
Type:
PROTEIN
Mol. Mass.:
105208.50
Organism:
Homo sapiens (Human)
Description:
ChEMBL_774238
Residue:
929
  
Inhibitor
Name:
BDBM16673
Synonyms:
4-[4-({[4-chloro-3-(trifluoromethyl)phenyl]carbamoyl}amino)phenoxy]-N-methylpyridine-2-carboxamide BAY 43-9006 BAY439006 Hit compound, 8 Sorafenib US10183928, Sorafenib US10227329, Compound Sorafenib US10774070, Compound Sorafenib US11279688, Compound Sorafenib US9029401, Sorafenib US9902709, Comparative example 1 cid_216239
Type:
Small organic molecule
Emp. Form.:
C21H16ClF3N4O3
Mol. Mass.:
464.825
SMILES:
CNC(=O)c1cc(Oc2ccc(NC(=O)Nc3ccc(Cl)c(c3)C(F)(F)F)cc2)ccn1
: