Target
Ephrin type-B receptor 6
Ligand
BDBM25045
Substrate
Meas. Tech.
ChEMBL_774437 (CHEMBL1908654)
Kd
>10000±n/a nM
Citation
 Davis, MIHunt, JPHerrgard, SCiceri, PWodicka, LMPallares, GHocker, MTreiber, DKZarrinkar, PP Comprehensive analysis of kinase inhibitor selectivity. Nat Biotechnol 29:1046-51 (2011)  
Target
Name:
Ephrin type-B receptor 6
Synonyms:
EPHB6 Ephrin receptor HEP | Tyrosine-protein kinase-defective receptor EPH-6
Type:
PROTEIN
Mol. Mass.:
110701.54
Organism:
Homo sapiens (Human)
Description:
ChEMBL_774437
Residue:
1021
  
Inhibitor
Name:
BDBM25045
Synonyms:
3-(4-morpholin-4-ylpyrido[2,3]furo[2,4-b]pyrimidin-2-yl)phenol 3-(4-morpholinopyrido[2,3]furo[2,4-b]pyrimidin-2-yl)phenol 3-[6-(morpholin-4-yl)-8-oxa-3,5,10-triazatricyclo[7.4.0.0^{2,7}]trideca-1(9),2,4,6,10,12-hexaen-4-yl]phenol PI-103 cid_9884685 pyridofuropyrimidine derivative, 2
Type:
Small organic molecule
Emp. Form.:
C19H16N4O3
Mol. Mass.:
348.3553
SMILES:
Oc1cccc(c1)-c1nc(N2CCOCC2)c2oc3ncccc3c2n1
: