Target
Serine/threonine-protein kinase DCLK3
Ligand
BDBM31088
Substrate
Meas. Tech.
ChEMBL_774187 (CHEMBL1908404)
Kd
>10000±n/a nM
Citation
 Davis, MIHunt, JPHerrgard, SCiceri, PWodicka, LMPallares, GHocker, MTreiber, DKZarrinkar, PP Comprehensive analysis of kinase inhibitor selectivity. Nat Biotechnol 29:1046-51 (2011)  
Target
Name:
Serine/threonine-protein kinase DCLK3
Synonyms:
DCAMKL3 DCLK3 KIAA1765 | Serine/threonine-protein kinase DCLK3
Type:
PROTEIN
Mol. Mass.:
73837.68
Organism:
Homo sapiens (Human)
Description:
ChEMBL_586565
Residue:
648
  
Inhibitor
Name:
BDBM31088
Synonyms:
1-methyl-5-[2-[5-(trifluoromethyl)-1H-imidazol-2-yl]pyridin-4-yl]oxy-N-[4-(trifluoromethyl)phenyl]benzimidazol-2-amine CHIR-265 cid_11656518
Type:
Small organic molecule
Emp. Form.:
C24H16F6N6O
Mol. Mass.:
518.4139
SMILES:
Cn1c(Nc2ccc(cc2)C(F)(F)F)nc2cc(Oc3ccnc(c3)-c3ncc([nH]3)C(F)(F)F)ccc12
: