Target
Serine/threonine-protein kinase 10
Ligand
BDBM482158
Substrate
Meas. Tech.
ChEMBL_774510 (CHEMBL1908727)
Kd
82±n/a nM
Citation
 Davis, MIHunt, JPHerrgard, SCiceri, PWodicka, LMPallares, GHocker, MTreiber, DKZarrinkar, PP Comprehensive analysis of kinase inhibitor selectivity. Nat Biotechnol 29:1046-51 (2011)  
Target
Name:
Serine/threonine-protein kinase 10
Synonyms:
LOK STK10_HUMAN Serine/threonine-protein kinase 10 (STK10)
Type:
Protein
Mol. Mass.:
112139.54
Organism:
Homo sapiens (Human)
Description:
O94804
Residue:
968
  
Inhibitor
Name:
BDBM482158
Synonyms:
BDBM50242742 | TAE684
Type:
Emp. Form.:
C30H40ClN7O3S
Mol. Mass.:
614.202
SMILES:
COc1cc(ccc1Nc1ncc(Cl)c(Nc2ccccc2S(=O)(=O)C(C)C)n1)N1CCC(CC1)N1CCN(C)CC1
: