Target
Mitogen-activated protein kinase kinase kinase 15
Ligand
BDBM27817
Substrate
Meas. Tech.
ChEMBL_774281 (CHEMBL1908498)
Kd
>10000±n/a nM
Citation
 Davis, MIHunt, JPHerrgard, SCiceri, PWodicka, LMPallares, GHocker, MTreiber, DKZarrinkar, PP Comprehensive analysis of kinase inhibitor selectivity. Nat Biotechnol 29:1046-51 (2011)  
Target
Name:
Mitogen-activated protein kinase kinase kinase 15
Synonyms:
ASK3 M3K15_HUMAN MAPK/ERK kinase kinase 15 MEKK 15
Type:
PROTEIN
Mol. Mass.:
147411.18
Organism:
Homo sapiens (Human)
Description:
ChEMBL_774281
Residue:
1313
  
Inhibitor
Name:
BDBM27817
Synonyms:
2-{[2-({1-[2-(dimethylamino)acetyl]-5-methoxy-2,3-dihydro-1H-indol-6-yl}amino)-7H-pyrrolo[2,3-d]pyrimidin-4-yl]amino}-6-fluoro-N-methylbenzamide | pyrrolo[2,3-d]pyrimidine deriv., 40
Type:
Small organic molecule
Emp. Form.:
C27H29FN8O3
Mol. Mass.:
532.5694
SMILES:
CNC(=O)c1c(F)cccc1Nc1nc(Nc2cc3N(CCc3cc2OC)C(=O)CN(C)C)nc2[nH]ccc12
: