Target
Mitogen-activated protein kinase kinase kinase 15
Ligand
BDBM13530
Substrate
Meas. Tech.
ChEMBL_774281 (CHEMBL1908498)
Kd
>10000±n/a nM
Citation
 Davis, MIHunt, JPHerrgard, SCiceri, PWodicka, LMPallares, GHocker, MTreiber, DKZarrinkar, PP Comprehensive analysis of kinase inhibitor selectivity. Nat Biotechnol 29:1046-51 (2011)  
Target
Name:
Mitogen-activated protein kinase kinase kinase 15
Synonyms:
ASK3 M3K15_HUMAN MAPK/ERK kinase kinase 15 MEKK 15
Type:
PROTEIN
Mol. Mass.:
147411.18
Organism:
Homo sapiens (Human)
Description:
ChEMBL_774281
Residue:
1313
  
Inhibitor
Name:
BDBM13530
Synonyms:
4-[(4-methylpiperazin-1-yl)methyl]-N-[4-methyl-3-[(4-pyridin-3-ylpyrimidin-2-yl)amino]phenyl]benzamide Gleevec Imatinib, 21 STI-571 US10906896, Cpd imatinib US11725005, Compound imatinib cid_5291 med.21724, Compound 6
Type:
Small organic molecule
Emp. Form.:
C29H31N7O
Mol. Mass.:
493.6027
SMILES:
CN1CCN(Cc2ccc(cc2)C(=O)Nc2ccc(C)c(Nc3nccc(n3)-c3cccnc3)c2)CC1
: