Target
Tyrosine-protein kinase Srms
Ligand
BDBM50355496
Substrate
Meas. Tech.
ChEMBL_774190 (CHEMBL1908407)
Kd
2700±n/a nM
Citation
 Davis, MIHunt, JPHerrgard, SCiceri, PWodicka, LMPallares, GHocker, MTreiber, DKZarrinkar, PP Comprehensive analysis of kinase inhibitor selectivity. Nat Biotechnol 29:1046-51 (2011)  
Target
Name:
Tyrosine-protein kinase Srms
Synonyms:
C20orf148 SRMS | SRMS_HUMAN
Type:
Enzyme Catalytic Domain
Mol. Mass.:
54517.24
Organism:
Homo sapiens (Human)
Description:
gi_18250298
Residue:
488
  
Inhibitor
Name:
BDBM50355496
Synonyms:
CHEMBL1908397
Type:
Small organic molecule
Emp. Form.:
C20H20N4O
Mol. Mass.:
332.399
SMILES:
O=C(N1CCNCC1)c1ccc(\C=C\c2n[nH]c3ccccc23)cc1
: