Target
Serine/threonine-protein kinase MRCK beta
Ligand
BDBM13336
Substrate
Meas. Tech.
ChEMBL_774511 (CHEMBL1908728)
Kd
2700±n/a nM
Citation
 Davis, MIHunt, JPHerrgard, SCiceri, PWodicka, LMPallares, GHocker, MTreiber, DKZarrinkar, PP Comprehensive analysis of kinase inhibitor selectivity. Nat Biotechnol 29:1046-51 (2011)  
Target
Name:
Serine/threonine-protein kinase MRCK beta
Synonyms:
CDC42BPB MRCKB Myotonic dystrophy kinase-related CDC42-binding kinase beta
Type:
Protien
Mol. Mass.:
194307.09
Organism:
Homo sapiens (Human)
Description:
Q9Y5S2
Residue:
1711
  
Inhibitor
Name:
BDBM13336
Synonyms:
4-[4-(4-fluorophenyl)-2-(4-methanesulfinylphenyl)-1H-imidazol-5-yl]pyridine 4-{4-(4-fluorophenyl)-2-[4-(methylsulfinyl)phenyl]-1H-imidazol-5-yl}pyridine SB-203580 cid_176155
Type:
Small organic molecule
Emp. Form.:
C21H16FN3OS
Mol. Mass.:
377.435
SMILES:
CS(=O)c1ccc(cc1)-c1nc(c([nH]1)-c1ccc(F)cc1)-c1ccncc1
: