Target
Phosphatidylinositol 4,5-bisphosphate 3-kinase catalytic subunit alpha isoform
Ligand
BDBM50315213
Substrate
Meas. Tech.
ChEMBL_776284 (CHEMBL1914129)
IC50
8.6±n/a nM
Citation
 Rewcastle, GWGamage, SAFlanagan, JUFrederick, RDenny, WABaguley, BCKestell, PSingh, RKendall, JDMarshall, ESLill, CLLee, WJKolekar, SBuchanan, CMJamieson, SMShepherd, PR Synthesis and biological evaluation of novel analogues of the pan class I phosphatidylinositol 3-kinase (PI3K) inhibitor 2-(difluoromethyl)-1-[4,6-di(4-morpholinyl)-1,3,5-triazin-2-yl]-1H-benzimidazole (ZSTK474). J Med Chem 54:7105-26 (2011)  
Target
Name:
Phosphatidylinositol 4,5-bisphosphate 3-kinase catalytic subunit alpha isoform
Synonyms:
PI3-kinase p110 subunit alpha PI3K Phosphatidylinositol 3-kinase p110α (p110α) Phosphatidylinositol-4,5-bisphosphate 3-kinase catalytic subunit alpha isoform PtdIns-3-kinase p110
Type:
Protein
Mol. Mass.:
124421.84
Organism:
Mus musculus (Mouse)
Description:
P42337
Residue:
1068
  
Inhibitor
Name:
BDBM50315213
Synonyms:
2-(difluoromethyl)-1-(4,6-dimorpholin-4-yl-1,3,5-triazin-2-yl)-1H-benzimidazole CHEMBL586702 | TCMDC-137004
Type:
Small organic molecule
Emp. Form.:
C19H21F2N7O2
Mol. Mass.:
417.4125
SMILES:
FC(F)c1nc2ccccc2n1-c1nc(nc(n1)N1CCOCC1)N1CCOCC1
: