Target
Prostaglandin G/H synthase 1
Ligand
BDBM50357364
Substrate
Meas. Tech.
ChEMBL_787667 (CHEMBL1918164)
IC50
6900±n/a nM
Citation
 Shaari, KSuppaiah, VWai, LKStanslas, JTejo, BAIsraf, DAAbas, FIsmail, ISShuaib, NHZareen, SLajis, NH Bioassay-guided identification of an anti-inflammatory prenylated acylphloroglucinol from Melicope ptelefolia and molecular insights into its interaction with 5-lipoxygenase. Bioorg Med Chem 19:6340-7 (2011)  
Target
Name:
Prostaglandin G/H synthase 1
Synonyms:
COX-1 Cyclooxygenase Cyclooxygenase-1 (COX-1) PTGS1 | Prostaglandin G/H synthase (cyclooxygenase)
Type:
Enzyme
Mol. Mass.:
68692.62
Organism:
Homo sapiens (Human)
Description:
P23219
Residue:
599
  
Inhibitor
Name:
BDBM50357364
Synonyms:
CHEMBL1242095
Type:
Small organic molecule
Emp. Form.:
C18H24O4
Mol. Mass.:
304.3808
SMILES:
[#6]\[#6](-[#6])=[#6]\[#6]-[#6]\[#6](-[#6])=[#6]\[#6]-c1c(-[#8])cc(-[#8])c(-[#6](-[#6])=O)c1-[#8]
: