Target
Polyunsaturated fatty acid 5-lipoxygenase
Ligand
BDBM50357364
Substrate
Meas. Tech.
ChEMBL_787591 (CHEMBL1917984)
IC50
1800±n/a nM
Citation
 Shaari, KSuppaiah, VWai, LKStanslas, JTejo, BAIsraf, DAAbas, FIsmail, ISShuaib, NHZareen, SLajis, NH Bioassay-guided identification of an anti-inflammatory prenylated acylphloroglucinol from Melicope ptelefolia and molecular insights into its interaction with 5-lipoxygenase. Bioorg Med Chem 19:6340-7 (2011)  
Target
Name:
Polyunsaturated fatty acid 5-lipoxygenase
Synonyms:
5-LO Alox5 LOX5_MOUSE
Type:
PROTEIN
Mol. Mass.:
77961.27
Organism:
Mus musculus
Description:
ChEMBL_675639
Residue:
674
  
Inhibitor
Name:
BDBM50357364
Synonyms:
CHEMBL1242095
Type:
Small organic molecule
Emp. Form.:
C18H24O4
Mol. Mass.:
304.3808
SMILES:
[#6]\[#6](-[#6])=[#6]\[#6]-[#6]\[#6](-[#6])=[#6]\[#6]-c1c(-[#8])cc(-[#8])c(-[#6](-[#6])=O)c1-[#8]
: