Target
Prostaglandin G/H synthase 2
Ligand
BDBM50357364
Substrate
Meas. Tech.
ChEMBL_787668 (CHEMBL1918165)
IC50
400±n/a nM
Citation
 Shaari, KSuppaiah, VWai, LKStanslas, JTejo, BAIsraf, DAAbas, FIsmail, ISShuaib, NHZareen, SLajis, NH Bioassay-guided identification of an anti-inflammatory prenylated acylphloroglucinol from Melicope ptelefolia and molecular insights into its interaction with 5-lipoxygenase. Bioorg Med Chem 19:6340-7 (2011)  
Target
Name:
Prostaglandin G/H synthase 2
Synonyms:
COX2 Cyclooxygenase 2 (COX-2) Cyclooxygenase-2 (COX-2 AA) Cyclooxygenase-2 (COX-2) PGH2_HUMAN PHS II Prostaglandin E synthase/G/H synthase 2 Prostaglandin-endoperoxide synthase 2
Type:
Enzyme
Mol. Mass.:
69003.89
Organism:
Homo sapiens (Human)
Description:
Recombinant Cox-2 provided by Cayman (Cayman Chemical Co.,Ann Arbor, MI).
Residue:
604
  
Inhibitor
Name:
BDBM50357364
Synonyms:
CHEMBL1242095
Type:
Small organic molecule
Emp. Form.:
C18H24O4
Mol. Mass.:
304.3808
SMILES:
[#6]\[#6](-[#6])=[#6]\[#6]-[#6]\[#6](-[#6])=[#6]\[#6]-c1c(-[#8])cc(-[#8])c(-[#6](-[#6])=O)c1-[#8]
: