Target
Protein kinase C delta type
Ligand
BDBM50163745
Substrate
Meas. Tech.
ChEMBL_787525 (CHEMBL1919486)
EC50
11550±n/a nM
Citation
 Das, JPany, SPanchal, SMajhi, ARahman, GM Binding of isoxazole and pyrazole derivatives of curcumin with the activator binding domain of novel protein kinase C. Bioorg Med Chem 19:6196-202 (2011)  
Target
Name:
Protein kinase C delta type
Synonyms:
KPCD_HUMAN PKCD Protein Kinase C- delta nPKC-delta
Type:
Enzyme
Mol. Mass.:
77516.79
Organism:
Homo sapiens (Human)
Description:
The recombinant human PKC enzymes were produced using a baculovirus expression system in SF9 cells
Residue:
676
  
Inhibitor
Name:
BDBM50163745
Synonyms:
4,40-(1E,10E)-2,20-(Isoxazole-3,5-diyl)bis(ethene-2,1-diyl)bis(2-methoxyphenol) 4-(-2-(5-(4-hydroxy-3-methoxystyryl)isoxazol-3-yl)vinyl)-2-methoxyphenol CHEMBL181529
Type:
Small organic molecule
Emp. Form.:
C21H19NO5
Mol. Mass.:
365.3793
SMILES:
COc1cc(\C=C\c2cc(\C=C\c3ccc(O)c(OC)c3)on2)ccc1O
: