Target
Protein kinase C delta type
Ligand
BDBM50357493
Substrate
Meas. Tech.
ChEMBL_787525 (CHEMBL1919486)
EC50
25230±n/a nM
Citation
 Das, JPany, SPanchal, SMajhi, ARahman, GM Binding of isoxazole and pyrazole derivatives of curcumin with the activator binding domain of novel protein kinase C. Bioorg Med Chem 19:6196-202 (2011)  
Target
Name:
Protein kinase C delta type
Synonyms:
KPCD_HUMAN PKCD Protein Kinase C- delta nPKC-delta
Type:
Enzyme
Mol. Mass.:
77516.79
Organism:
Homo sapiens (Human)
Description:
The recombinant human PKC enzymes were produced using a baculovirus expression system in SF9 cells
Residue:
676
  
Inhibitor
Name:
BDBM50357493
Synonyms:
CHEMBL1914610
Type:
Small organic molecule
Emp. Form.:
C29H35NO5
Mol. Mass.:
477.5919
SMILES:
CCCCOc1ccc(\C=C\c2cc(\C=C\c3ccc(OCCCC)c(OC)c3)on2)cc1OC
: