Target
Calpain-1 catalytic subunit
Ligand
BDBM50358144
Substrate
Meas. Tech.
ChEMBL_788734 (CHEMBL1924665)
IC50
21000±n/a nM
Citation
 Stuart, BGCoxon, JMMorton, JDAbell, ADMcDonald, DQAitken, SGJones, MABickerstaffe, R Molecular modeling: a search for a calpain inhibitor as a new treatment for cataractogenesis. J Med Chem 54:7503-22 (2011)  
Target
Name:
Calpain-1 catalytic subunit
Synonyms:
CAN1_RAT Capn1 | Cls1
Type:
PROTEIN
Mol. Mass.:
82108.68
Organism:
Rattus norvegicus
Description:
ChEMBL_788734
Residue:
713
  
Inhibitor
Name:
BDBM50358144
Synonyms:
CHEMBL1923967
Type:
Small organic molecule
Emp. Form.:
C18H27FN2O4S
Mol. Mass.:
386.481
SMILES:
CC(C)C[C@H](NC(=O)[C@H](C(C)C)N(C)S(=O)(=O)c1ccc(F)cc1)C=O
: