Target
Coagulation factor X
Ligand
BDBM50359000
Substrate
Meas. Tech.
ChEMBL_790969 (CHEMBL1925585)
IC50
0.48±n/a nM
Citation
 Mochizuki, ANagata, TKanno, HTakano, DKishida, MSuzuki, MOhta, T Orally active zwitterionic factor Xa inhibitors with long duration of action. Bioorg Med Chem Lett 21:7337-43 (2011)  
Target
Name:
Coagulation factor X
Synonyms:
Activated coagulation factor X (FXa) Coagulation factor X precursor F10 Factor X heavy chain Factor Xa Stuart-Prower factor
Type:
Enzyme
Mol. Mass.:
54726.60
Organism:
Homo sapiens (Human)
Description:
Residue:
488
  
Inhibitor
Name:
BDBM50359000
Synonyms:
CHEMBL1923893
Type:
Small organic molecule
Emp. Form.:
C27H26ClF3N4O4S
Mol. Mass.:
595.033
SMILES:
CC(C)N1CCc2nc(sc2C1)C(=O)Nc1cc(cc(c1CCC(=O)Nc1ccc(Cl)cc1)C(F)(F)F)C(O)=O
: