Target
Glucagon receptor
Ligand
BDBM50360600
Substrate
Meas. Tech.
ChEMBL_795440 (CHEMBL1937445)
Ki
356±n/a nM
Citation
 Filipski, KJBian, JEbner, DCLee, ECLi, JCSammons, MFWright, SWStevens, BDDidiuk, MTTu, MPerreault, CBrown, JAtkinson, KTan, BSalatto, CTLitchfield, JPfefferkorn, JAGuzman-Perez, A A novel series of glucagon receptor antagonists with reduced molecular weight and lipophilicity. Bioorg Med Chem Lett 22:415-20 (2011)  
Target
Name:
Glucagon receptor
Synonyms:
GCGR GLR_HUMAN Glucagon receptor (GlucR)
Type:
Enzyme
Mol. Mass.:
54026.92
Organism:
Homo sapiens (Human)
Description:
P47871
Residue:
477
  
Inhibitor
Name:
BDBM50360600
Synonyms:
CHEMBL1933348
Type:
Small organic molecule
Emp. Form.:
C23H31FO
Mol. Mass.:
342.49
SMILES:
CCCc1c(cc(C(C)C)c(C(C)O)c1-c1ccc(F)cc1)C(C)C
: