Target
Melanin-concentrating hormone receptor 2
Ligand
BDBM50360702
Substrate
Meas. Tech.
ChEMBL_795932 (CHEMBL1936805)
IC50
0.1±n/a nM
Citation
 Chen, XMihalic, JFan, PLiang, LLindstrom, MWong, SYe, QFu, YJaen, JChen, JLDai, KLi, L Discovery and characterization of a potent and selective antagonist of melanin-concentrating hormone receptor 2. Bioorg Med Chem Lett 22:363-6 (2011)  
Target
Name:
Melanin-concentrating hormone receptor 2
Synonyms:
GPR145 MCHR2_HUMAN Melanin-concentrating hormone receptor SLT
Type:
Enzyme Catalytic Domain
Mol. Mass.:
38862.16
Organism:
Homo sapiens (Human)
Description:
Melanin Concentrating Hormone 2 GPR145 HUMAN::Q969V1
Residue:
340
  
Inhibitor
Name:
BDBM50360702
Synonyms:
CHEMBL1934121
Type:
Small organic molecule
Emp. Form.:
C30H33N3O
Mol. Mass.:
451.6025
SMILES:
CCn1c2ccccc2c2cc(CN3CCC4(CC(NC(C)=O)c5ccccc45)CC3)ccc12
: