Target
Sodium-dependent serotonin transporter
Ligand
BDBM25874
Substrate
Meas. Tech.
ChEMBL_802188 (CHEMBL1949346)
IC50
95.5±n/a nM
Citation
 Jaronczyk, MWolosewicz, KGabrielsen, MNowak, GKufareva, IMazurek, APRavna, AWAbagyan, RBojarski, AJSylte, IChilmonczyk, Z Synthesis, in vitro binding studies and docking of long-chain arylpiperazine nitroquipazine analogues, as potential serotonin transporter inhibitors. Eur J Med Chem 49:200-10 (2012)  
Target
Name:
Sodium-dependent serotonin transporter
Synonyms:
5-HT Transporter 5HT transporter Anandamid membrane transporter, AMT Monoamine transporters; Norepinephrine & serotonin Slc6a4 Sodium-dependent serotonin transporter (SERT) | imipramine receptor
Type:
Multi-pass membrane protein
Mol. Mass.:
70168.43
Organism:
Rattus norvegicus (rat)
Description:
P31652
Residue:
630
  
Inhibitor
Name:
BDBM25874
Synonyms:
2-{4-[4-(quinolin-2-yl)piperazin-1-yl]butyl}-2,3-dihydro-1H-isoindole-1,3-dione | buspirone analogue, 5
Type:
Small organic molecule
Emp. Form.:
C25H26N4O2
Mol. Mass.:
414.4995
SMILES:
O=C1N(CCCCN2CCN(CC2)c2ccc3ccccc3n2)C(=O)c2ccccc12
: