Target
Sodium-dependent serotonin transporter
Ligand
BDBM25875
Substrate
Meas. Tech.
ChEMBL_802188 (CHEMBL1949346)
IC50
111.6±n/a nM
Citation
 Jaronczyk, MWolosewicz, KGabrielsen, MNowak, GKufareva, IMazurek, APRavna, AWAbagyan, RBojarski, AJSylte, IChilmonczyk, Z Synthesis, in vitro binding studies and docking of long-chain arylpiperazine nitroquipazine analogues, as potential serotonin transporter inhibitors. Eur J Med Chem 49:200-10 (2012)  
Target
Name:
Sodium-dependent serotonin transporter
Synonyms:
5-HT Transporter 5HT transporter Anandamid membrane transporter, AMT Monoamine transporters; Norepinephrine & serotonin Slc6a4 Sodium-dependent serotonin transporter (SERT) | imipramine receptor
Type:
Multi-pass membrane protein
Mol. Mass.:
70168.43
Organism:
Rattus norvegicus (rat)
Description:
P31652
Residue:
630
  
Inhibitor
Name:
BDBM25875
Synonyms:
8-{4-[4-(quinolin-2-yl)piperazin-1-yl]butyl}-8-azaspiro[4.5]decane-7,9-dione buspirone analogue, 6
Type:
Small organic molecule
Emp. Form.:
C26H34N4O2
Mol. Mass.:
434.5738
SMILES:
O=C1CC2(CCCC2)CC(=O)N1CCCCN1CCN(CC1)c1ccc2ccccc2n1
: