Target
5-hydroxytryptamine receptor 1A
Ligand
BDBM50363808
Substrate
Meas. Tech.
ChEMBL_802189 (CHEMBL1949347)
Ki
776.5±n/a nM
Citation
 Jaronczyk, MWolosewicz, KGabrielsen, MNowak, GKufareva, IMazurek, APRavna, AWAbagyan, RBojarski, AJSylte, IChilmonczyk, Z Synthesis, in vitro binding studies and docking of long-chain arylpiperazine nitroquipazine analogues, as potential serotonin transporter inhibitors. Eur J Med Chem 49:200-10 (2012)  
Target
Name:
5-hydroxytryptamine receptor 1A
Synonyms:
5-HT-1A 5-hydroxytryptamine receptor 1A (5-HT-1A) ADRB2RL1 Dopamine D2 receptor and serotonin 1a receptor HTR1A | Serotonin receptor 1A
Type:
Mol. Mass.:
46122.49
Organism:
Homo sapiens (Human)
Description:
Residue:
422
  
Inhibitor
Name:
BDBM50363808
Synonyms:
CHEMBL1945679
Type:
Small organic molecule
Emp. Form.:
C27H35N5O4
Mol. Mass.:
493.5979
SMILES:
CC1CN(CCN1CCCCN1C(=O)CC2(CCCC2)CC1=O)c1ccc2cc(ccc2n1)[N+]([O-])=O
: