Target
5-hydroxytryptamine receptor 1A
Ligand
BDBM50363811
Substrate
Meas. Tech.
ChEMBL_802189 (CHEMBL1949347)
Ki
2100±n/a nM
Citation
 Jaronczyk, MWolosewicz, KGabrielsen, MNowak, GKufareva, IMazurek, APRavna, AWAbagyan, RBojarski, AJSylte, IChilmonczyk, Z Synthesis, in vitro binding studies and docking of long-chain arylpiperazine nitroquipazine analogues, as potential serotonin transporter inhibitors. Eur J Med Chem 49:200-10 (2012)  
Target
Name:
5-hydroxytryptamine receptor 1A
Synonyms:
5-HT-1A 5-hydroxytryptamine receptor 1A (5-HT-1A) ADRB2RL1 Dopamine D2 receptor and serotonin 1a receptor HTR1A | Serotonin receptor 1A
Type:
Mol. Mass.:
46122.49
Organism:
Homo sapiens (Human)
Description:
Residue:
422
  
Inhibitor
Name:
BDBM50363811
Synonyms:
CHEMBL1945682
Type:
Small organic molecule
Emp. Form.:
C24H31N5O4
Mol. Mass.:
453.534
SMILES:
CC1(C)CC(=O)N(CCCCN2CCN(CC2)c2ccc3cc(ccc3n2)[N+]([O-])=O)C(=O)C1
: