Target
5-hydroxytryptamine receptor 1A
Ligand
BDBM50363814
Substrate
Meas. Tech.
ChEMBL_802189 (CHEMBL1949347)
Ki
3200±n/a nM
Citation
 Jaronczyk, MWolosewicz, KGabrielsen, MNowak, GKufareva, IMazurek, APRavna, AWAbagyan, RBojarski, AJSylte, IChilmonczyk, Z Synthesis, in vitro binding studies and docking of long-chain arylpiperazine nitroquipazine analogues, as potential serotonin transporter inhibitors. Eur J Med Chem 49:200-10 (2012)  
Target
Name:
5-hydroxytryptamine receptor 1A
Synonyms:
5-HT-1A 5-hydroxytryptamine receptor 1A (5-HT-1A) ADRB2RL1 Dopamine D2 receptor and serotonin 1a receptor HTR1A | Serotonin receptor 1A
Type:
Mol. Mass.:
46122.49
Organism:
Homo sapiens (Human)
Description:
Residue:
422
  
Inhibitor
Name:
BDBM50363814
Synonyms:
CHEMBL1945685
Type:
Small organic molecule
Emp. Form.:
C28H37N5O3
Mol. Mass.:
491.6251
SMILES:
CC(=O)Nc1ccc2nc(ccc2c1)N1CCN(CCCCN2C(=O)CC3(CCCC3)CC2=O)CC1
: