Target
Glutamate receptor ionotropic, NMDA 1/2A
Ligand
BDBM50164540
Substrate
Meas. Tech.
ChEMBL_802333 (CHEMBL1954477)
Ki
17600±n/a nM
Citation
 Irvine, MWCosta, BMDlaboga, DCulley, GRHulse, RScholefield, CLAtlason, PFang, GEaves, RMorley, RMayo-Martin, MBAmici, MBortolotto, ZADonaldson, LCollingridge, GLMolnár, EMonaghan, DTJane, DE Piperazine-2,3-dicarboxylic acid derivatives as dual antagonists of NMDA and GluK1-containing kainate receptors. J Med Chem 55:327-41 (2012)  
Target
Name:
Glutamate receptor ionotropic, NMDA 1/2A
Synonyms:
Glutamate NMDA receptor; Grin1/Grin2a | Glutamate [NMDA] receptor subunit epsilon 1/zeta 1
Type:
Mol. Mass.:
Description:
ASSAY_ID of EBI is 141020
Components:
This complex has 2 components.
Component 1
Name:
Glutamate receptor ionotropic, NMDA 2A
Synonyms:
Glutamate NMDA receptor; Grin1/Grin2a Grin2a NMDE1_RAT
Type:
Protein
Mol. Mass.:
165478.25
Organism:
Rattus norvegicus (Rat)
Description:
Q00959
Residue:
1464
  
Component 2
Name:
Glutamate receptor ionotropic, NMDA 1
Synonyms:
Glutamate (NMDA) receptor subunit zeta 1 Glutamate-NMDA-Channel Glutamate-NMDA-Polyamine NMDA Nmdar1 | phencyclidine
Type:
Enzyme Catalytic Domain
Mol. Mass.:
105533.40
Organism:
RAT
Description:
P35439
Residue:
938
  
Inhibitor
Name:
BDBM50164540
Synonyms:
(2R,3S)-1-(Phenanthrene-2-carbonyl)-piperazine-2,3-dicarboxylic acid | CHEMBL372468
Type:
Small organic molecule
Emp. Form.:
C21H18N2O5
Mol. Mass.:
378.378
SMILES:
OC(=O)[C@H]1NCCN([C@H]1C(O)=O)C(=O)c1ccc2c(ccc3ccccc23)c1
: