Target
Estrogen receptor
Ligand
BDBM50106635
Substrate
Meas. Tech.
ChEMBL_802366 (CHEMBL1954673)
EC50
3.4±n/a nM
Citation
 Carroll, VMJeyakumar, MCarlson, KEKatzenellenbogen, JA Diarylpropionitrile (DPN) enantiomers: synthesis and evaluation of estrogen receptorß-selective ligands. J Med Chem 55:528-37 (2012)  
Target
Name:
Estrogen receptor
Synonyms:
ER ESR ESR1_HUMAN Estrogen receptor Estrogen receptor (ER-alpha) Estrogen receptor alpha (ER) Nuclear receptor subfamily 3 group A member 1
Type:
Protein
Mol. Mass.:
66230.44
Organism:
Homo sapiens (Human)
Description:
P03372
Residue:
595
  
Inhibitor
Name:
BDBM50106635
Synonyms:
(+/-)-2,3-bis(4-hydroxyphenyl)propanenitrile 2,3-bis(4-hydroxyphenyl)propanenitrile DIARYLPROPIONITRILE
Type:
Small organic molecule
Emp. Form.:
C15H13NO2
Mol. Mass.:
239.2692
SMILES:
Oc1ccc(CC(C#N)c2ccc(O)cc2)cc1
: