Target
Serine/threonine-protein kinase pim-3
Ligand
BDBM50364794
Substrate
Meas. Tech.
ChEMBL_803132 (CHEMBL1954568)
IC50
55±n/a nM
Citation
 Pastor, JOyarzabal, JSaluste, GAlvarez, RMRivero, VRamos, FCendón, EBlanco-Aparicio, CAjenjo, NCebriá, AAlbarrán, MICebrián, DCorrionero, AFominaya, JMontoya, GMazzorana, M Hit to lead evaluation of 1,2,3-triazolo[4,5-b]pyridines as PIM kinase inhibitors. Bioorg Med Chem Lett 22:1591-7 (2012)  
Target
Name:
Serine/threonine-protein kinase pim-3
Synonyms:
PIM3 Serine/threonine-protein kinase pim-3 (PIM3)
Type:
Protein
Mol. Mass.:
35888.19
Organism:
Homo sapiens (Human)
Description:
Q86V86
Residue:
326
  
Inhibitor
Name:
BDBM50364794
Synonyms:
CHEMBL1952132
Type:
Small organic molecule
Emp. Form.:
C18H18F3N5O2
Mol. Mass.:
393.363
SMILES:
O[C@H]1CC[C@@H](CC1)Nc1ccc2nnn(-c3cccc(OC(F)(F)F)c3)c2n1
: