Target
Baculoviral IAP repeat-containing protein 2
Ligand
BDBM50365843
Substrate
Meas. Tech.
ChEMBL_806259 (CHEMBL1958905)
IC50
<2±n/a nM
Citation
 Bianchi, AUgazzi, MFerrante, LLecis, DScavullo, CMastrangelo, ESeneci, P Rational design, synthesis and characterization of potent, drug-like monomeric Smac mimetics as pro-apoptotic anticancer agents. Bioorg Med Chem Lett 22:2204-8 (2012)  
Target
Name:
Baculoviral IAP repeat-containing protein 2
Synonyms:
API1 BIRC2_HUMAN Cellular inhibitor of apoptosis 1 MIHB | RNF48
Type:
Protein
Mol. Mass.:
69900.47
Organism:
Homo sapiens (Human)
Description:
Q13490
Residue:
618
  
Inhibitor
Name:
BDBM50365843
Synonyms:
CHEMBL1957107
Type:
Small organic molecule
Emp. Form.:
C37H48N6O3
Mol. Mass.:
624.8154
SMILES:
CC[C@H](NC)C(=O)N[C@H]1[C@@H](CCNCc2ccc(N)cc2)CC[C@H]2CC[C@H](N2C1=O)C(=O)NC(c1ccccc1)c1ccccc1
: