Target
Vasoactive intestinal polypeptide receptor 1
Ligand
BDBM50365985
Substrate
Meas. Tech.
ChEMBL_807309 (CHEMBL1960402)
IC50
100±n/a nM
Citation
 Harikrishnan, LSSrivastava, NKayser, LENirschl, DSKumaragurubaran, KRoy, AGupta, AKarmakar, SKaratt, TMathur, ABurford, NTChen, JKong, YCvijic, MCooper, CBPoss, MATrainor, GLWong, TW Identification and optimization of small molecule antagonists of vasoactive intestinal peptide receptor-1 (VIPR1). Bioorg Med Chem Lett 22:2287-90 (2012)  
Target
Name:
Vasoactive intestinal polypeptide receptor 1
Synonyms:
PACAP type II receptor PACAP-R2 VIP-R-1 Vipr1
Type:
PROTEIN
Mol. Mass.:
52068.73
Organism:
Rattus norvegicus
Description:
ChEMBL_807309
Residue:
459
  
Inhibitor
Name:
BDBM50365985
Synonyms:
CHEMBL1956426
Type:
Small organic molecule
Emp. Form.:
C20H25ClO
Mol. Mass.:
316.865
SMILES:
CC(C)c1cc(cc(-c2cccc(Cl)c2)c1CO)C(C)(C)C
: