Target
Carbonic anhydrase 9
Ligand
BDBM50366098
Substrate
Meas. Tech.
ChEMBL_808112 (CHEMBL1961263)
Ki
800±n/a nM
Citation
 Carta, FMaresca, AScozzafava, ASupuran, CT Novel coumarins and 2-thioxo-coumarins as inhibitors of the tumor-associated carbonic anhydrases IX and XII. Bioorg Med Chem 20:2266-73 (2012)  
Target
Name:
Carbonic anhydrase 9
Synonyms:
CA-IX CAH9_HUMAN Carbonic anhydrase 9 (CA IX) Carbonic anhydrase 9 precursor Carbonic anhydrase IX (CAIX) Carbonic anhydrases; II & IX MN RCC-associated antigen G250
Type:
Enzyme
Mol. Mass.:
49669.03
Organism:
Homo sapiens (Human)
Description:
Catalytic domain of human cloned isozyme was used in the assay
Residue:
459
  
Inhibitor
Name:
BDBM50366098
Synonyms:
CHEMBL1957177
Type:
Small organic molecule
Emp. Form.:
C9H6O2S
Mol. Mass.:
178.208
SMILES:
Oc1ccc2oc(=S)ccc2c1
: