Target
Matrix metalloproteinase-14
Ligand
BDBM50366173
Substrate
Meas. Tech.
ChEMBL_805647 (CHEMBL1960481)
IC50
160±n/a nM
Citation
 Topai, ABreccia, PMinissi, FPadova, AMarini, SCerbara, I In silico scaffold evaluation and solid phase approach to identify new gelatinase inhibitors. Bioorg Med Chem 20:2323-37 (2012)  
Target
Name:
Matrix metalloproteinase-14
Synonyms:
MMP-14 MMP14 MT-MMP 1 MT1MMP Matrix Metalloproteinase-14 (MMP-14) Matrix metalloproteinase-14 Membrane-type matrix metalloproteinase 1 | Membrane-type-1 matrix metalloproteinase
Type:
Protein
Mol. Mass.:
65900.19
Organism:
Homo sapiens (Human)
Description:
P50281
Residue:
582
  
Inhibitor
Name:
BDBM50366173
Synonyms:
CHEMBL1957604
Type:
Small organic molecule
Emp. Form.:
C16H16N2O5S2
Mol. Mass.:
380.439
SMILES:
ONC(=O)[C@@H]1CS(=O)CN1S(=O)(=O)c1ccc(cc1)-c1ccccc1
: