Target
72 kDa type IV collagenase
Ligand
BDBM50366205
Substrate
Meas. Tech.
ChEMBL_805641 (CHEMBL1960475)
IC50
10±n/a nM
Citation
 Topai, ABreccia, PMinissi, FPadova, AMarini, SCerbara, I In silico scaffold evaluation and solid phase approach to identify new gelatinase inhibitors. Bioorg Med Chem 20:2323-37 (2012)  
Target
Name:
72 kDa type IV collagenase
Synonyms:
72 kDa gelatinase CLG4A Gelatinase A (MMP-2) MMP2_HUMAN Matrix metalloproteinase-2 (MMP 2) Matrix metalloproteinases 2 (MMP-2) | TBE-1
Type:
Enzyme
Mol. Mass.:
73870.36
Organism:
Homo sapiens (Human)
Description:
P08253
Residue:
660
  
Inhibitor
Name:
BDBM50366205
Synonyms:
CHEMBL1957603
Type:
Small organic molecule
Emp. Form.:
C16H15FN2O5S2
Mol. Mass.:
398.429
SMILES:
ONC(=O)[C@@H]1CSCN1S(=O)(=O)c1ccc(Oc2ccc(F)cc2)cc1
: