Target
72 kDa type IV collagenase
Ligand
BDBM50366174
Substrate
Meas. Tech.
ChEMBL_805641 (CHEMBL1960475)
IC50
53±n/a nM
Citation
 Topai, ABreccia, PMinissi, FPadova, AMarini, SCerbara, I In silico scaffold evaluation and solid phase approach to identify new gelatinase inhibitors. Bioorg Med Chem 20:2323-37 (2012)  
Target
Name:
72 kDa type IV collagenase
Synonyms:
72 kDa gelatinase CLG4A Gelatinase A (MMP-2) MMP2_HUMAN Matrix metalloproteinase-2 (MMP 2) Matrix metalloproteinases 2 (MMP-2) | TBE-1
Type:
Enzyme
Mol. Mass.:
73870.36
Organism:
Homo sapiens (Human)
Description:
P08253
Residue:
660
  
Inhibitor
Name:
BDBM50366174
Synonyms:
CHEMBL1957605
Type:
Small organic molecule
Emp. Form.:
C16H16N2O6S2
Mol. Mass.:
396.438
SMILES:
ONC(=O)[C@@H]1CS(=O)(=O)CN1S(=O)(=O)c1ccc(cc1)-c1ccccc1
: